{"text_format":"3","workbook":"xlsx","n_sheets":7,"sheets":["健診ｺｰｽ (ﾄﾞｯｸ)","2018変更案内　","spreedResult.","torikomi","Course","PD","CD"],"not_rendered":{"macros":1,"external_links":5,"defined_names":30},"read":"whole","date_system":"1900"}

{"sheet":"健診ｺｰｽ (ﾄﾞｯｸ)","index":0,"n_rows":97,"n_cols":11,"rows_kept":97,"hidden":true,"merged":[[3,0,3,2],[4,0,4,2],[5,0,6,0],[5,1,5,2],[6,1,6,2],[7,0,11,0],[7,1,7,2],[7,10,10,10],[8,1,8,2],[9,1,9,2],[10,1,10,2],[11,1,11,2],[12,1,12,2],[13,0,16,0],[13,1,13,2],[14,1,14,2],[15,1,15,2],[15,10,16,10],[16,1,16,2],[17,1,17,2],[18,0,23,0],[18,1,18,2],[19,1,19,2],[19,10,21,10],[20,1,20,2],[21,1,21,2],[22,1,22,2],[22,10,23,10],[23,1,23,2],[24,0,58,0],[24,1,24,2],[24,10,27,10],[25,1,25,2],[26,1,26,2],[27,1,27,2],[28,1,28,2],[28,10,30,10],[29,1,29,2],[30,1,30,2],[31,1,31,2],[31,10,33,10],[32,1,32,2],[33,1,33,2],[34,1,34,2],[35,1,35,2],[36,1,36,2],[37,1,37,2],[38,1,38,2],[38,10,41,10],[39,1,39,2],[40,1,40,2],[41,1,41,2],[42,1,42,2],[42,10,43,10],[43,1,43,2],[44,1,44,2],[44,10,45,10],[45,1,45,2],[46,1,46,2],[47,1,47,2],[48,1,48,2],[48,10,49,10],[49,1,49,2],[50,1,50,2],[51,1,51,2],[52,1,52,2],[52,10,54,10],[53,1,53,2],[54,1,54,2],[55,1,55,2],[56,1,56,2],[57,1,57,2],[58,1,58,2],[60,0,61,0],[60,1,60,2],[61,1,61,2],[63,1,63,2],[64,1,64,2],[65,1,65,2],[66,0,68,0],[66,1,66,2],[67,1,67,2],[68,1,68,2],[69,1,69,2],[70,1,70,2],[71,1,71,2],[72,0,73,0],[72,1,72,2],[72,10,73,10],[73,1,73,2],[74,1,74,2],[75,1,75,2],[76,1,76,2],[77,0,78,0],[77,1,77,2],[77,10,78,10],[78,1,78,2],[82,0,82,2],[83,1,83,2],[84,1,84,2],[85,0,86,0],[85,1,85,2],[86,1,86,2],[87,0,88,0],[87,1,87,2],[88,1,88,2],[90,0,90,2],[91,1,91,2],[92,1,92,2],[93,0,94,0],[93,1,93,2],[94,1,94,2],[95,0,96,0],[95,1,95,2],[96,1,96,2]]}
["別紙"]
["　　2018年度　人間ドック　項目一覧表"]
[{"$nulls":3},"新コース",null,"旧コース"]
["検　　査　　項　　目",null,null,"vﾄﾞｯｸ(新)\n人間ﾄﾞｯｸ学会指定項目準拠ｺｰｽ　+　追加検査項目","人間ﾄﾞｯｸ(学会指定ｺｰｽ)\n人間ﾄﾞｯｸ学会指定項目準拠ｺｰｽ","vﾄﾞｯｸ","Sﾄﾞｯｸ","Aﾄﾞｯｸ","Bﾄﾞｯｸ","ﾚﾃﾞｨｰｽﾄﾞｯｸ","病気との関係"]
["健　　診　　料　　金(税込）",null,null,{"v":77760,"d":"77,760"},{"v":39960,"d":"39,960"},{"v":83160,"d":"83,160"},{"v":47520,"d":"47,520"},{"v":35640,"d":"35,640"},{"v":29160,"d":"29,160"},{"v":47520,"d":"47,520"}]
["問診","既往歴の調査、自覚症状の調査、問診",null,"○","○","○","○","○","○","○"]
[null,"理学的所見（診察）",null,"○","○","○","○","○","○","○"]
["身体測定","身長",null,"○","○","○","○","○","○","○","肥満度(肥満・やせ）"]
[null,"体重",null,"○","○","○","○","○","○","○"]
[null,"肥満度（ＢＭＩ）",null,"○","○","○","○","○","○","○"]
{"$rows_left_out":88}
{"sheet":"2018変更案内　","index":1,"n_rows":52,"n_cols":7,"rows_kept":52,"hidden":true,"merged":[[0,6,0,8]]}
[{"$nulls":6},"2018-03-01"]
[]
[]
["健診ご担当者　様"]
{"$rows_empty":8}
[null,"　　　　　　　人間ドックのコース内容の変更について"]
{"$rows_empty":7}
[null,"  拝啓、毎々格別のご高配に預かり厚くお礼申し上げます。"]
[]
[null,"  平素は私ども芝健診ｾﾝﾀｰをご利用頂き誠にありがとうございます。さて、新年度を迎えるにあたりまして、"]
{"$rows_left_out":30}
{"sheet":"spreedResult.","index":2,"n_rows":238,"n_cols":60,"rows_kept":238,"merged":[[1,2,1,6],[2,2,2,6],[3,2,3,6],[3,8,3,11],[4,2,4,6],[5,2,5,6],[6,2,6,6],[7,2,7,6],[7,8,7,11],[8,2,8,6],[9,2,9,6]]}
["お申込み用紙",null,"作成日",null,null,{"$f":"LastSaveTime()","v":"2021-03-05T10:55:31"},{"$nulls":10},"注意事項：",{"$nulls":29},"時間コード",null,"PD","CD",null,null,"有機溶剤健診",{"$nulls":5},"コース名称","コース"]
[null,"事業所様名 ",{"$nulls":14},"妊娠中の方（妊娠している可能性のある方も含む）は、安全性を考慮し、ご受診をお控え頂いております",{"$nulls":29},"08:00:00",11,{"$nulls":4},"特定化学物質検査",{"$nulls":5},"法令健診","09580"]
[null,"ご住所    　〒",{"$nulls":6},"お支払方法",{"$nulls":7},"健診当日に生理中の方の子宮頚がん検査は、中止か後日受診となります",{"$nulls":29},"08:30:00",12,null,"性別",null,null,"じん肺健診",{"$nulls":5},"入社健診(08)","09603"]
[{"$nulls":16},"外国語対応は一切行っておりません。通訳が必要となる際は、通訳者の同伴をお願い致します",{"$nulls":29},"09:00:00",13,null,"男",1,null,"石綿健診",{"$nulls":5},"生活習慣病(胃直接)","09616"]
[{"$nulls":16},"健診当日の高血圧・糖尿病等の常用薬の服用については主治医にご相談ください",{"$nulls":29},"09:30:00",14,null,"女",2,null,"高気圧業務健診",{"$nulls":5},"生活習慣病(胃なし)","09609"]
[null,"ご担当者     ",{"$nulls":14},"事前に送付させて頂く問診票の注意事項（食事の制限など）を厳守してください",{"$nulls":29},"10:00:00",15,{"$nulls":4},"電離放射健診",{"$nulls":5},"協会一般","09615"]
[null,"お電話番号  ",{"$nulls":6},"問診票/結果/請求書送付先",{"$nulls":7},"　　　　　（厳守頂けない場合、健診の一部を中止することがございます）",{"$nulls":29},"10:30:00",16,{"$nulls":4},"情報機器",{"$nulls":5},"協会一般(胃ｶﾒﾗ)","09618"]
[null,"FAX番号 　　",{"$nulls":14},"結果の送付まで2-3週間程度頂いております",{"$nulls":29},"11:00:00",17,"左記ご住所に送付",{"$nulls":9},"協会一般(胃なし)","09653"]
[null,"保険証記号　",{"$nulls":14},"ご予約のキャンセル、ご予約日及び時間のご変更などは、必ず前日までにご連絡ください。",{"$nulls":29},"11:30:00",18,"その他：下記に記載",{"$nulls":3},"会社様ご請求",{"$nulls":5},"協会一般＋付加","09617"]
[null,"保険者番号　",{"$nulls":14},"　　　　　ご連絡いただけない場合にはｷｬﾝｾﾙ料が発生する場合がございます。",{"$nulls":29},"14:00:00",23,{"$nulls":4},"当日個々にお支払",{"$nulls":5},"協会一般＋付加(胃ｶﾒﾗ)","09655"]
{"$rows_left_out":229}
{"sheet":"torikomi","index":3,"n_rows":262,"n_cols":53,"rows_kept":262,"hidden":true}
[]
[null,"予約日_西暦8桁","時間帯","契約コード(親番)","契約コード(枝番)","団体ｺｰﾄﾞ(親)","団体ｺｰﾄﾞ(枝)","コースコード","個人番号_ｼｽﾃﾑ桁数適用","カナ氏名","漢字氏名","性別","生年月日_西暦8桁","所属ｺｰﾄﾞ","所属内番号","保険者番号","保険証記号","保険証番号","送付先区分","自宅_郵便番号","自宅_住所１","自宅_住所2","自宅_ＴＥＬ","協会健保整理番号","受診券整理番号","受診券有効期限","追加項目①","追加・削除区分①","追加項目②","追加・削除区分②","追加項目③","追加・削除区分③","追加項目④","追加・削除区分④","追加項目⑤","追加・削除区分⑤","追加項目⑥","追加・削除区分⑥","追加項目⑦","追加・削除区分⑦","追加項目⑧","追加・削除区分⑧","追加項目⑨","追加・削除区分⑨","追加項目⑩","追加・削除区分⑩","予約時ｺﾒﾝﾄ","属性要素4(分会)","属性要素5(群)","連絡先_郵便番号","連絡先_住所１","連絡先_住所２","連絡先_TEL"]
[null,{"$f":"IF(spreedResult.!B14<>\"\",TEXT(spreedResult.!B14,\"YYYY\")&TEXT(spreedResult.!B14,\"MM\")&TEXT(spreedResult.!B14,\"DD\"),\"\")","v":""},{"$f":"IF(spreedResult.!C14<>\"\",VLOOKUP(spreedResult.!C14,spreedResult.!AU2:AV13,2,0),\"\")","v":""},{"$nulls":4},{"$f":"IF(spreedResult.!P14<>\"\",VLOOKUP(spreedResult.!P14,Course!$A$2:$B$612,2,0),\"\")","v":""},null,{"$f":"CONCATENATE(TRIM(ASC(spreedResult.!F14)),\" \",TRIM(ASC(spreedResult.!G14)))","v":" "},{"$f":"CONCATENATE(TRIM(spreedResult.!H14),\"　\",TRIM(spreedResult.!I14))","v":"　"},{"$f":"IFERROR(VLOOKUP(spreedResult.!K14,spreedResult.!$AX$4:$AY$5,2,0),\"\")","v":""},{"$f":"IF(spreedResult.!L14<>\"\",TEXT(spreedResult.!L14,\"YYYY\")&TEXT(spreedResult.!L14,\"MM\")&TEXT(spreedResult.!L14,\"DD\"),\"\")","v":""},{"$nulls":4},{"$f":"IF(spreedResult.!M14<>\"\",spreedResult.!M14,\"\")","v":""},{"$f":"IF(spreedResult.!H14<>\"\",IF(spreedResult.!$I$8=\"左記ご住所に送付\",\"2\",\"\"),\"\")","v":""},{"$nulls":8},{"$f":"IF(ISNUMBER(AA3),\"1\",\"\")","v":""},null,{"$f":"IF(ISNUMBER(AC3),\"1\",\"\")","v":""},null,{"$f":"IF(ISNUMBER(AE3),\"1\",\"\")","v":""},null,{"$f":"IF(ISNUMBER(AG3),\"1\",\"\")","v":""},null,{"$f":"IF(ISNUMBER(AI3),\"1\",\"\")","v":""},null,{"$f":"IF(ISNUMBER(AK3),\"1\",\"\")","v":""},null,{"$f":"IF(ISNUMBER(AM3),\"1\",\"\")","v":""},null,{"$f":"IF(ISNUMBER(AO3),\"1\",\"\")","v":""},null,{"$f":"IF(ISNUMBER(AQ3),\"1\",\"\")","v":""},null,{"$f":"IF(ISNUMBER(AS3),\"1\",\"\")","v":""}]
[null,{"$f":"IF(spreedResult.!B15<>\"\",TEXT(spreedResult.!B15,\"YYYY\")&TEXT(spreedResult.!B15,\"MM\")&TEXT(spreedResult.!B15,\"DD\"),\"\")","v":""},{"$f":"IF(spreedResult.!C15<>\"\",VLOOKUP(spreedResult.!C15,spreedResult.!$AU$2:$AV$12,2,0),\"\")","v":""},{"$nulls":4},{"$f":"IF(spreedResult.!P15<>\"\",VLOOKUP(spreedResult.!P15,Course!$A$2:$B$612,2,0),\"\")","v":""},null,{"$f":"CONCATENATE(TRIM(ASC(spreedResult.!F15)),\" \",TRIM(ASC(spreedResult.!G15)))","v":" "},{"$f":"CONCATENATE(TRIM(spreedResult.!H15),\"　\",TRIM(spreedResult.!I15))","v":"　"},{"$f":"IFERROR(VLOOKUP(spreedResult.!K15,spreedResult.!$AX$4:$AY$5,2,0),\"\")","v":""},{"$f":"IF(spreedResult.!L15<>\"\",TEXT(spreedResult.!L15,\"YYYY\")&TEXT(spreedResult.!L15,\"MM\")&TEXT(spreedResult.!L15,\"DD\"),\"\")","v":""},{"$nulls":4},{"$f":"IF(spreedResult.!M15<>\"\",spreedResult.!M15,\"\")","v":""},{"$f":"IF(spreedResult.!H15<>\"\",IF(spreedResult.!$I$8=\"左記ご住所に送付\",\"2\",\"\"),\"\")","v":""},{"$nulls":8},{"$f":"IF(ISNUMBER(AA4),\"1\",\"\")","v":""},null,{"$f":"IF(ISNUMBER(AC4),\"1\",\"\")","v":""},null,{"$f":"IF(ISNUMBER(AE4),\"1\",\"\")","v":""},null,{"$f":"IF(ISNUMBER(AG4),\"1\",\"\")","v":""},null,{"$f":"IF(ISNUMBER(AI4),\"1\",\"\")","v":""},null,{"$f":"IF(ISNUMBER(AK4),\"1\",\"\")","v":""},null,{"$f":"IF(ISNUMBER(AM4),\"1\",\"\")","v":""},null,{"$f":"IF(ISNUMBER(AO4),\"1\",\"\")","v":""},null,{"$f":"IF(ISNUMBER(AQ4),\"1\",\"\")","v":""},null,{"$f":"IF(ISNUMBER(AS4),\"1\",\"\")","v":""}]
[null,{"$f":"IF(spreedResult.!B16<>\"\",TEXT(spreedResult.!B16,\"YYYY\")&TEXT(spreedResult.!B16,\"MM\")&TEXT(spreedResult.!B16,\"DD\"),\"\")","v":""},{"$f":"IF(spreedResult.!C16<>\"\",VLOOKUP(spreedResult.!C16,spreedResult.!$AU$2:$AV$12,2,0),\"\")","v":""},{"$nulls":4},{"$f":"IF(spreedResult.!P16<>\"\",VLOOKUP(spreedResult.!P16,Course!$A$2:$B$612,2,0),\"\")","v":""},null,{"$f":"CONCATENATE(TRIM(ASC(spreedResult.!F16)),\" \",TRIM(ASC(spreedResult.!G16)))","v":" "},{"$f":"CONCATENATE(TRIM(spreedResult.!H16),\"　\",TRIM(spreedResult.!I16))","v":"　"},{"$f":"IFERROR(VLOOKUP(spreedResult.!K16,spreedResult.!$AX$4:$AY$5,2,0),\"\")","v":""},{"$f":"IF(spreedResult.!L16<>\"\",TEXT(spreedResult.!L16,\"YYYY\")&TEXT(spreedResult.!L16,\"MM\")&TEXT(spreedResult.!L16,\"DD\"),\"\")","v":""},{"$nulls":4},{"$f":"IF(spreedResult.!M16<>\"\",spreedResult.!M16,\"\")","v":""},{"$f":"IF(spreedResult.!H16<>\"\",IF(spreedResult.!$I$8=\"左記ご住所に送付\",\"2\",\"\"),\"\")","v":""},{"$nulls":8},{"$f":"IF(ISNUMBER(AA5),\"1\",\"\")","v":""},null,{"$f":"IF(ISNUMBER(AC5),\"1\",\"\")","v":""},null,{"$f":"IF(ISNUMBER(AE5),\"1\",\"\")","v":""},null,{"$f":"IF(ISNUMBER(AG5),\"1\",\"\")","v":""},null,{"$f":"IF(ISNUMBER(AI5),\"1\",\"\")","v":""},null,{"$f":"IF(ISNUMBER(AK5),\"1\",\"\")","v":""},null,{"$f":"IF(ISNUMBER(AM5),\"1\",\"\")","v":""},null,{"$f":"IF(ISNUMBER(AO5),\"1\",\"\")","v":""},null,{"$f":"IF(ISNUMBER(AQ5),\"1\",\"\")","v":""},null,{"$f":"IF(ISNUMBER(AS5),\"1\",\"\")","v":""}]
[null,{"$f":"IF(spreedResult.!B17<>\"\",TEXT(spreedResult.!B17,\"YYYY\")&TEXT(spreedResult.!B17,\"MM\")&TEXT(spreedResult.!B17,\"DD\"),\"\")","v":""},{"$f":"IF(spreedResult.!C17<>\"\",VLOOKUP(spreedResult.!C17,spreedResult.!$AU$2:$AV$12,2,0),\"\")","v":""},{"$nulls":4},{"$f":"IF(spreedResult.!P17<>\"\",VLOOKUP(spreedResult.!P17,Course!$A$2:$B$612,2,0),\"\")","v":""},null,{"$f":"CONCATENATE(TRIM(ASC(spreedResult.!F17)),\" \",TRIM(ASC(spreedResult.!G17)))","v":" "},{"$f":"CONCATENATE(TRIM(spreedResult.!H17),\"　\",TRIM(spreedResult.!I17))","v":"　"},{"$f":"IFERROR(VLOOKUP(spreedResult.!K17,spreedResult.!$AX$4:$AY$5,2,0),\"\")","v":""},{"$f":"IF(spreedResult.!L17<>\"\",TEXT(spreedResult.!L17,\"YYYY\")&TEXT(spreedResult.!L17,\"MM\")&TEXT(spreedResult.!L17,\"DD\"),\"\")","v":""},{"$nulls":4},{"$f":"IF(spreedResult.!M17<>\"\",spreedResult.!M17,\"\")","v":""},{"$f":"IF(spreedResult.!H17<>\"\",IF(spreedResult.!$I$8=\"左記ご住所に送付\",\"2\",\"\"),\"\")","v":""},{"$nulls":8},"",null,"",null,"",null,"",null,"",null,"",null,"",null,"",null,"",null,""]
[null,{"$f":"IF(spreedResult.!B18<>\"\",TEXT(spreedResult.!B18,\"YYYY\")&TEXT(spreedResult.!B18,\"MM\")&TEXT(spreedResult.!B18,\"DD\"),\"\")","v":""},{"$f":"IF(spreedResult.!C18<>\"\",VLOOKUP(spreedResult.!C18,spreedResult.!$AU$2:$AV$12,2,0),\"\")","v":""},{"$nulls":4},{"$f":"IF(spreedResult.!P18<>\"\",VLOOKUP(spreedResult.!P18,Course!$A$2:$B$612,2,0),\"\")","v":""},null,{"$f":"CONCATENATE(TRIM(ASC(spreedResult.!F18)),\" \",TRIM(ASC(spreedResult.!G18)))","v":" "},{"$f":"CONCATENATE(TRIM(spreedResult.!H18),\"　\",TRIM(spreedResult.!I18))","v":"　"},{"$f":"IFERROR(VLOOKUP(spreedResult.!K18,spreedResult.!$AX$4:$AY$5,2,0),\"\")","v":""},{"$f":"IF(spreedResult.!L18<>\"\",TEXT(spreedResult.!L18,\"YYYY\")&TEXT(spreedResult.!L18,\"MM\")&TEXT(spreedResult.!L18,\"DD\"),\"\")","v":""},{"$nulls":4},{"$f":"IF(spreedResult.!M18<>\"\",spreedResult.!M18,\"\")","v":""},{"$f":"IF(spreedResult.!H18<>\"\",IF(spreedResult.!$I$8=\"左記ご住所に送付\",\"2\",\"\"),\"\")","v":""},{"$nulls":8},"",null,"",null,"",null,"",null,"",null,"",null,"",null,"",null,"",null,""]
[null,{"$f":"IF(spreedResult.!B19<>\"\",TEXT(spreedResult.!B19,\"YYYY\")&TEXT(spreedResult.!B19,\"MM\")&TEXT(spreedResult.!B19,\"DD\"),\"\")","v":""},{"$f":"IF(spreedResult.!C19<>\"\",VLOOKUP(spreedResult.!C19,spreedResult.!$AU$2:$AV$12,2,0),\"\")","v":""},{"$nulls":4},{"$f":"IF(spreedResult.!P19<>\"\",VLOOKUP(spreedResult.!P19,Course!$A$2:$B$612,2,0),\"\")","v":""},null,{"$f":"CONCATENATE(TRIM(ASC(spreedResult.!F19)),\" \",TRIM(ASC(spreedResult.!G19)))","v":" "},{"$f":"CONCATENATE(TRIM(spreedResult.!H19),\"　\",TRIM(spreedResult.!I19))","v":"　"},{"$f":"IFERROR(VLOOKUP(spreedResult.!K19,spreedResult.!$AX$4:$AY$5,2,0),\"\")","v":""},{"$f":"IF(spreedResult.!L19<>\"\",TEXT(spreedResult.!L19,\"YYYY\")&TEXT(spreedResult.!L19,\"MM\")&TEXT(spreedResult.!L19,\"DD\"),\"\")","v":""},{"$nulls":4},{"$f":"IF(spreedResult.!M19<>\"\",spreedResult.!M19,\"\")","v":""},{"$f":"IF(spreedResult.!H19<>\"\",IF(spreedResult.!$I$8=\"左記ご住所に送付\",\"2\",\"\"),\"\")","v":""},{"$nulls":8},"",null,"",null,"",null,"",null,"",null,"",null,"",null,"",null,"",null,""]
[null,{"$f":"IF(spreedResult.!B20<>\"\",TEXT(spreedResult.!B20,\"YYYY\")&TEXT(spreedResult.!B20,\"MM\")&TEXT(spreedResult.!B20,\"DD\"),\"\")","v":""},{"$f":"IF(spreedResult.!C20<>\"\",VLOOKUP(spreedResult.!C20,spreedResult.!$AU$2:$AV$12,2,0),\"\")","v":""},{"$nulls":4},{"$f":"IF(spreedResult.!P20<>\"\",VLOOKUP(spreedResult.!P20,Course!$A$2:$B$612,2,0),\"\")","v":""},null,{"$f":"CONCATENATE(TRIM(ASC(spreedResult.!F20)),\" \",TRIM(ASC(spreedResult.!G20)))","v":" "},{"$f":"CONCATENATE(TRIM(spreedResult.!H20),\"　\",TRIM(spreedResult.!I20))","v":"　"},{"$f":"IFERROR(VLOOKUP(spreedResult.!K20,spreedResult.!$AX$4:$AY$5,2,0),\"\")","v":""},{"$f":"IF(spreedResult.!L20<>\"\",TEXT(spreedResult.!L20,\"YYYY\")&TEXT(spreedResult.!L20,\"MM\")&TEXT(spreedResult.!L20,\"DD\"),\"\")","v":""},{"$nulls":4},{"$f":"IF(spreedResult.!M20<>\"\",spreedResult.!M20,\"\")","v":""},{"$f":"IF(spreedResult.!H20<>\"\",IF(spreedResult.!$I$8=\"左記ご住所に送付\",\"2\",\"\"),\"\")","v":""},{"$nulls":8},{"$f":"IF(ISNUMBER(AA9),\"1\",\"\")","v":""},null,{"$f":"IF(ISNUMBER(AC9),\"1\",\"\")","v":""},null,{"$f":"IF(ISNUMBER(AE9),\"1\",\"\")","v":""},null,{"$f":"IF(ISNUMBER(AG9),\"1\",\"\")","v":""},null,{"$f":"IF(ISNUMBER(AI9),\"1\",\"\")","v":""},null,{"$f":"IF(ISNUMBER(AK9),\"1\",\"\")","v":""},null,{"$f":"IF(ISNUMBER(AM9),\"1\",\"\")","v":""},null,{"$f":"IF(ISNUMBER(AO9),\"1\",\"\")","v":""},null,{"$f":"IF(ISNUMBER(AQ9),\"1\",\"\")","v":""},null,{"$f":"IF(ISNUMBER(AS9),\"1\",\"\")","v":""}]
[null,{"$f":"IF(spreedResult.!B21<>\"\",TEXT(spreedResult.!B21,\"YYYY\")&TEXT(spreedResult.!B21,\"MM\")&TEXT(spreedResult.!B21,\"DD\"),\"\")","v":""},{"$f":"IF(spreedResult.!C21<>\"\",VLOOKUP(spreedResult.!C21,spreedResult.!$AU$2:$AV$12,2,0),\"\")","v":""},{"$nulls":4},{"$f":"IF(spreedResult.!P21<>\"\",VLOOKUP(spreedResult.!P21,Course!$A$2:$B$612,2,0),\"\")","v":""},null,{"$f":"CONCATENATE(TRIM(ASC(spreedResult.!F21)),\" \",TRIM(ASC(spreedResult.!G21)))","v":" "},{"$f":"CONCATENATE(TRIM(spreedResult.!H21),\"　\",TRIM(spreedResult.!I21))","v":"　"},{"$f":"IFERROR(VLOOKUP(spreedResult.!K21,spreedResult.!$AX$4:$AY$5,2,0),\"\")","v":""},{"$f":"IF(spreedResult.!L21<>\"\",TEXT(spreedResult.!L21,\"YYYY\")&TEXT(spreedResult.!L21,\"MM\")&TEXT(spreedResult.!L21,\"DD\"),\"\")","v":""},{"$nulls":4},{"$f":"IF(spreedResult.!M21<>\"\",spreedResult.!M21,\"\")","v":""},{"$f":"IF(spreedResult.!H21<>\"\",IF(spreedResult.!$I$8=\"左記ご住所に送付\",\"2\",\"\"),\"\")","v":""},{"$nulls":8},"",null,"",null,"",null,"",null,"",null,"",null,"",null,"",null,"",null,""]
{"$rows_left_out":253}
{"sheet":"Course","index":4,"n_rows":614,"n_cols":2,"rows_kept":614,"hidden":true}
["コース","コースID"]
["*ｺｰﾌﾟﾈｯﾄ深夜業健診（34才以下）",9589]
["*ｺｰﾌﾟﾈｯﾄ深夜業健診（35才以上）",9586]
["13AIA生活習慣病(胃直接)",10208]
["13ｶﾈｶ健保(35才.40才以上)",10206]
["13ｶﾈｶ健保(36才～39才)",10207]
["13大阪菓子(生活習慣病)",10203]
["13大阪菓子(婦人健診)ﾏﾝﾓ",10250]
["13大阪菓子(婦人健診)乳腺ｴｺｰ",10205]
["13大阪産業機械(生活習慣病)",10204]
{"$rows_left_out":605}
{"sheet":"PD","index":5,"n_rows":0,"n_cols":0,"rows_kept":0,"hidden":true}

{"sheet":"CD","index":6,"n_rows":0,"n_cols":0,"rows_kept":0,"hidden":true}