{"text_format":"3","workbook":"xlsx","n_sheets":5,"sheets":["spreedResult.","torikomi","Course","PD","CD"],"not_rendered":{"macros":1,"external_links":5,"defined_names":24},"read":"whole","date_system":"1900"}

{"sheet":"spreedResult.","index":0,"n_rows":158,"n_cols":59,"rows_kept":158,"merged":[[1,2,1,5],[2,2,2,5],[3,2,3,5],[3,7,3,10],[4,2,4,5],[5,2,5,5],[6,2,6,5],[7,2,7,5],[7,7,7,10],[8,2,8,5],[9,2,9,5]]}
["お申込み用紙",null,"作成日",null,{"$f":"LastSaveTime()","v":"2018-04-11T16:54:40"},{"$nulls":40},"時間コード",null,"PD","CD",{"$nulls":8},"コース名称","コース"]
[null,"事業所様名 ",{"$nulls":13},"ご注意事項：",{"$nulls":29},"08:00:00",11,{"$nulls":10},"協会一般","09615"]
[null,"ご住所    　〒",{"$nulls":5},"お支払方法",{"$nulls":7},"妊娠中の方（妊娠している可能性のある方も含む）は、安全性を考慮し、ご受診をお断りさせて頂いております",{"$nulls":29},"08:30:00",12,null,"性別",{"$nulls":8},"協会一般(胃なし)","09653"]
[{"$nulls":15},"健診当日に生理中の方の子宮頚がん検査は、中止か後日受診となります",{"$nulls":29},"09:00:00",13,null,"男",1,{"$nulls":7},"協会一般(胸なし)","09669"]
[{"$nulls":15},"外国語対応は一切行っておりません。通訳が必要となる際は、通訳者の同伴をお願い致します",{"$nulls":29},"09:30:00",14,null,"女",2,{"$nulls":7},"協会一般＋付加","09617"]
[null,"ご担当者     ",{"$nulls":13},"健診当日の高血圧・糖尿病等の常用薬の服用については主治医にご相談ください",{"$nulls":29},"10:00:00",15,{"$nulls":10},"協会一般＋付加(胃なし)","09666"]
[null,"お電話番号  ",{"$nulls":5},"問診票/結果/請求書送付先",{"$nulls":7},"事前に送付させて頂く問診票の注意事項（食事の制限など）を厳守してください",{"$nulls":29},"10:30:00",16,{"$nulls":10},"協会一般(胃ｶﾒﾗ)","09618"]
[null,"FAX番号 　　",{"$nulls":13},"　　　　　（厳守頂けない場合、健診の一部を中止することがございます）",{"$nulls":29},"11:00:00",17,"左記ご住所に送付",{"$nulls":9},"定期Ａ(08)","09600"]
[null,"保険証記号　",{"$nulls":13},"結果の送付まで3-4週間程頂いております",{"$nulls":29},"14:00:00",23,"その他：下記に記載",{"$nulls":3},"会社様ご請求",{"$nulls":5},"協会一般＋付加(胃ｶﾒﾗ)","09655"]
[null,"保険者番号　",{"$nulls":13},"本確定書にない一切の特別対応は致しかねますので事前にご了承ください",{"$nulls":18},"→ご参考まで",{"$nulls":10},"14:30:00",24,{"$nulls":4},"当日個々にお支払",{"$nulls":5},"定期Ｂ(08)","09601"]
{"$rows_left_out":149}
{"sheet":"torikomi","index":1,"n_rows":262,"n_cols":53,"rows_kept":262,"hidden":true}
[]
[null,"予約日_西暦8桁","時間帯","契約コード(親番)","契約コード(枝番)","団体ｺｰﾄﾞ(親)","団体ｺｰﾄﾞ(枝)","コースコード","個人番号_ｼｽﾃﾑ桁数適用","カナ氏名","漢字氏名","性別","生年月日_西暦8桁","所属ｺｰﾄﾞ","所属内番号","保険者番号","保険証記号","保険証番号","送付先区分","自宅_郵便番号","自宅_住所１","自宅_住所2","自宅_ＴＥＬ","協会健保整理番号","受診券整理番号","受診券有効期限","追加項目①","追加・削除区分①","追加項目②","追加・削除区分②","追加項目③","追加・削除区分③","追加項目④","追加・削除区分④","追加項目⑤","追加・削除区分⑤","追加項目⑥","追加・削除区分⑥","追加項目⑦","追加・削除区分⑦","追加項目⑧","追加・削除区分⑧","追加項目⑨","追加・削除区分⑨","追加項目⑩","追加・削除区分⑩","予約時ｺﾒﾝﾄ","属性要素4(分会)","属性要素5(群)","連絡先_郵便番号","連絡先_住所１","連絡先_住所２","連絡先_TEL"]
[null,{"$f":"IF(spreedResult.!B14<>\"\",TEXT(spreedResult.!B14,\"YYYY\")&TEXT(spreedResult.!B14,\"MM\")&TEXT(spreedResult.!B14,\"DD\"),\"\")","v":""},{"$f":"IF(spreedResult.!C14<>\"\",VLOOKUP(spreedResult.!C14,spreedResult.!$AT$2:$AU$12,2,0),\"\")","v":""},{"$nulls":4},{"$f":"IF(spreedResult.!O14<>\"\",VLOOKUP(spreedResult.!O14,Course!$A$2:$B$612,2,0),\"\")","v":""},null,{"$f":"CONCATENATE(TRIM(ASC(spreedResult.!E14)),\" \",TRIM(ASC(spreedResult.!F14)))","v":" "},{"$f":"CONCATENATE(TRIM(spreedResult.!G14),\"　\",TRIM(spreedResult.!H14))","v":"　"},{"$f":"IFERROR(VLOOKUP(spreedResult.!J14,spreedResult.!$AW$4:$AX$5,2,0),\"\")","v":""},{"$f":"IF(spreedResult.!K14<>\"\",TEXT(spreedResult.!K14,\"YYYY\")&TEXT(spreedResult.!K14,\"MM\")&TEXT(spreedResult.!K14,\"DD\"),\"\")","v":""},null,null,{"$f":"IF(spreedResult.!$E14<>\"\",spreedResult.!$C$10,\"\")","v":""},{"$f":"IF(spreedResult.!$E14<>\"\",spreedResult.!$C$9,\"\")","v":""},{"$f":"IF(spreedResult.!L14<>\"\",spreedResult.!L14,\"\")","v":""},{"$f":"IF(spreedResult.!G14<>\"\",IF(spreedResult.!$H$8=\"左記ご住所に送付\",\"2\",\"\"),\"\")","v":""},{"$nulls":8},{"$f":"IF(ISNUMBER(AA3),\"1\",\"\")","v":""},null,{"$f":"IF(ISNUMBER(AC3),\"1\",\"\")","v":""},null,{"$f":"IF(ISNUMBER(AE3),\"1\",\"\")","v":""},null,{"$f":"IF(ISNUMBER(AG3),\"1\",\"\")","v":""},null,{"$f":"IF(ISNUMBER(AI3),\"1\",\"\")","v":""},null,{"$f":"IF(ISNUMBER(AK3),\"1\",\"\")","v":""},null,{"$f":"IF(ISNUMBER(AM3),\"1\",\"\")","v":""},null,{"$f":"IF(ISNUMBER(AO3),\"1\",\"\")","v":""},null,{"$f":"IF(ISNUMBER(AQ3),\"1\",\"\")","v":""},null,{"$f":"IF(ISNUMBER(AS3),\"1\",\"\")","v":""}]
[null,{"$f":"IF(spreedResult.!B15<>\"\",TEXT(spreedResult.!B15,\"YYYY\")&TEXT(spreedResult.!B15,\"MM\")&TEXT(spreedResult.!B15,\"DD\"),\"\")","v":""},{"$f":"IF(spreedResult.!C15<>\"\",VLOOKUP(spreedResult.!C15,spreedResult.!$AT$2:$AU$12,2,0),\"\")","v":""},{"$nulls":4},{"$f":"IF(spreedResult.!O15<>\"\",VLOOKUP(spreedResult.!O15,Course!$A$2:$B$612,2,0),\"\")","v":""},null,{"$f":"CONCATENATE(TRIM(ASC(spreedResult.!E15)),\" \",TRIM(ASC(spreedResult.!F15)))","v":" "},{"$f":"CONCATENATE(TRIM(spreedResult.!G15),\"　\",TRIM(spreedResult.!H15))","v":"　"},{"$f":"IFERROR(VLOOKUP(spreedResult.!J15,spreedResult.!$AW$4:$AX$5,2,0),\"\")","v":""},{"$f":"IF(spreedResult.!K15<>\"\",TEXT(spreedResult.!K15,\"YYYY\")&TEXT(spreedResult.!K15,\"MM\")&TEXT(spreedResult.!K15,\"DD\"),\"\")","v":""},null,null,{"$f":"IF(spreedResult.!$E15<>\"\",spreedResult.!$C$10,\"\")","v":""},{"$f":"IF(spreedResult.!$E15<>\"\",spreedResult.!$C$9,\"\")","v":""},{"$f":"IF(spreedResult.!L15<>\"\",spreedResult.!L15,\"\")","v":""},{"$f":"IF(spreedResult.!G15<>\"\",IF(spreedResult.!$H$8=\"左記ご住所に送付\",\"2\",\"\"),\"\")","v":""},{"$nulls":8},{"$f":"IF(ISNUMBER(AA4),\"1\",\"\")","v":""},null,{"$f":"IF(ISNUMBER(AC4),\"1\",\"\")","v":""},null,{"$f":"IF(ISNUMBER(AE4),\"1\",\"\")","v":""},null,{"$f":"IF(ISNUMBER(AG4),\"1\",\"\")","v":""},null,{"$f":"IF(ISNUMBER(AI4),\"1\",\"\")","v":""},null,{"$f":"IF(ISNUMBER(AK4),\"1\",\"\")","v":""},null,{"$f":"IF(ISNUMBER(AM4),\"1\",\"\")","v":""},null,{"$f":"IF(ISNUMBER(AO4),\"1\",\"\")","v":""},null,{"$f":"IF(ISNUMBER(AQ4),\"1\",\"\")","v":""},null,{"$f":"IF(ISNUMBER(AS4),\"1\",\"\")","v":""}]
[null,{"$f":"IF(spreedResult.!B16<>\"\",TEXT(spreedResult.!B16,\"YYYY\")&TEXT(spreedResult.!B16,\"MM\")&TEXT(spreedResult.!B16,\"DD\"),\"\")","v":""},{"$f":"IF(spreedResult.!C16<>\"\",VLOOKUP(spreedResult.!C16,spreedResult.!$AT$2:$AU$12,2,0),\"\")","v":""},{"$nulls":4},{"$f":"IF(spreedResult.!O16<>\"\",VLOOKUP(spreedResult.!O16,Course!$A$2:$B$612,2,0),\"\")","v":""},null,{"$f":"CONCATENATE(TRIM(ASC(spreedResult.!E16)),\" \",TRIM(ASC(spreedResult.!F16)))","v":" "},{"$f":"CONCATENATE(TRIM(spreedResult.!G16),\"　\",TRIM(spreedResult.!H16))","v":"　"},{"$f":"IFERROR(VLOOKUP(spreedResult.!J16,spreedResult.!$AW$4:$AX$5,2,0),\"\")","v":""},{"$f":"IF(spreedResult.!K16<>\"\",TEXT(spreedResult.!K16,\"YYYY\")&TEXT(spreedResult.!K16,\"MM\")&TEXT(spreedResult.!K16,\"DD\"),\"\")","v":""},null,null,{"$f":"IF(spreedResult.!$E16<>\"\",spreedResult.!$C$10,\"\")","v":""},{"$f":"IF(spreedResult.!$E16<>\"\",spreedResult.!$C$9,\"\")","v":""},{"$f":"IF(spreedResult.!L16<>\"\",spreedResult.!L16,\"\")","v":""},{"$f":"IF(spreedResult.!G16<>\"\",IF(spreedResult.!$H$8=\"左記ご住所に送付\",\"2\",\"\"),\"\")","v":""},{"$nulls":8},"",null,"",null,"",null,"",null,"",null,"",null,"",null,"",null,"",null,""]
[null,{"$f":"IF(spreedResult.!B17<>\"\",TEXT(spreedResult.!B17,\"YYYY\")&TEXT(spreedResult.!B17,\"MM\")&TEXT(spreedResult.!B17,\"DD\"),\"\")","v":""},{"$f":"IF(spreedResult.!C17<>\"\",VLOOKUP(spreedResult.!C17,spreedResult.!$AT$2:$AU$12,2,0),\"\")","v":""},{"$nulls":4},{"$f":"IF(spreedResult.!O17<>\"\",VLOOKUP(spreedResult.!O17,Course!$A$2:$B$612,2,0),\"\")","v":""},null,{"$f":"CONCATENATE(TRIM(ASC(spreedResult.!E17)),\" \",TRIM(ASC(spreedResult.!F17)))","v":" "},{"$f":"CONCATENATE(TRIM(spreedResult.!G17),\"　\",TRIM(spreedResult.!H17))","v":"　"},{"$f":"IFERROR(VLOOKUP(spreedResult.!J17,spreedResult.!$AW$4:$AX$5,2,0),\"\")","v":""},{"$f":"IF(spreedResult.!K17<>\"\",TEXT(spreedResult.!K17,\"YYYY\")&TEXT(spreedResult.!K17,\"MM\")&TEXT(spreedResult.!K17,\"DD\"),\"\")","v":""},null,null,{"$f":"IF(spreedResult.!$E17<>\"\",spreedResult.!$C$10,\"\")","v":""},{"$f":"IF(spreedResult.!$E17<>\"\",spreedResult.!$C$9,\"\")","v":""},{"$f":"IF(spreedResult.!L17<>\"\",spreedResult.!L17,\"\")","v":""},{"$f":"IF(spreedResult.!G17<>\"\",IF(spreedResult.!$H$8=\"左記ご住所に送付\",\"2\",\"\"),\"\")","v":""},{"$nulls":8},"",null,"",null,"",null,"",null,"",null,"",null,"",null,"",null,"",null,""]
[null,{"$f":"IF(spreedResult.!B18<>\"\",TEXT(spreedResult.!B18,\"YYYY\")&TEXT(spreedResult.!B18,\"MM\")&TEXT(spreedResult.!B18,\"DD\"),\"\")","v":""},{"$f":"IF(spreedResult.!C18<>\"\",VLOOKUP(spreedResult.!C18,spreedResult.!$AT$2:$AU$12,2,0),\"\")","v":""},{"$nulls":4},{"$f":"IF(spreedResult.!O18<>\"\",VLOOKUP(spreedResult.!O18,Course!$A$2:$B$612,2,0),\"\")","v":""},null,{"$f":"CONCATENATE(TRIM(ASC(spreedResult.!E18)),\" \",TRIM(ASC(spreedResult.!F18)))","v":" "},{"$f":"CONCATENATE(TRIM(spreedResult.!G18),\"　\",TRIM(spreedResult.!H18))","v":"　"},{"$f":"IFERROR(VLOOKUP(spreedResult.!J18,spreedResult.!$AW$4:$AX$5,2,0),\"\")","v":""},{"$f":"IF(spreedResult.!K18<>\"\",TEXT(spreedResult.!K18,\"YYYY\")&TEXT(spreedResult.!K18,\"MM\")&TEXT(spreedResult.!K18,\"DD\"),\"\")","v":""},null,null,{"$f":"IF(spreedResult.!$E18<>\"\",spreedResult.!$C$10,\"\")","v":""},{"$f":"IF(spreedResult.!$E18<>\"\",spreedResult.!$C$9,\"\")","v":""},{"$f":"IF(spreedResult.!L18<>\"\",spreedResult.!L18,\"\")","v":""},{"$f":"IF(spreedResult.!G18<>\"\",IF(spreedResult.!$H$8=\"左記ご住所に送付\",\"2\",\"\"),\"\")","v":""},{"$nulls":8},"",null,"",null,"",null,"",null,"",null,"",null,"",null,"",null,"",null,""]
[null,{"$f":"IF(spreedResult.!B19<>\"\",TEXT(spreedResult.!B19,\"YYYY\")&TEXT(spreedResult.!B19,\"MM\")&TEXT(spreedResult.!B19,\"DD\"),\"\")","v":""},{"$f":"IF(spreedResult.!C19<>\"\",VLOOKUP(spreedResult.!C19,spreedResult.!$AT$2:$AU$12,2,0),\"\")","v":""},{"$nulls":4},{"$f":"IF(spreedResult.!O19<>\"\",VLOOKUP(spreedResult.!O19,Course!$A$2:$B$612,2,0),\"\")","v":""},null,{"$f":"CONCATENATE(TRIM(ASC(spreedResult.!E19)),\" \",TRIM(ASC(spreedResult.!F19)))","v":" "},{"$f":"CONCATENATE(TRIM(spreedResult.!G19),\"　\",TRIM(spreedResult.!H19))","v":"　"},{"$f":"IFERROR(VLOOKUP(spreedResult.!J19,spreedResult.!$AW$4:$AX$5,2,0),\"\")","v":""},{"$f":"IF(spreedResult.!K19<>\"\",TEXT(spreedResult.!K19,\"YYYY\")&TEXT(spreedResult.!K19,\"MM\")&TEXT(spreedResult.!K19,\"DD\"),\"\")","v":""},null,null,{"$f":"IF(spreedResult.!$E19<>\"\",spreedResult.!$C$10,\"\")","v":""},{"$f":"IF(spreedResult.!$E19<>\"\",spreedResult.!$C$9,\"\")","v":""},{"$f":"IF(spreedResult.!L19<>\"\",spreedResult.!L19,\"\")","v":""},{"$f":"IF(spreedResult.!G19<>\"\",IF(spreedResult.!$H$8=\"左記ご住所に送付\",\"2\",\"\"),\"\")","v":""},{"$nulls":8},"",null,"",null,"",null,"",null,"",null,"",null,"",null,"",null,"",null,""]
[null,{"$f":"IF(spreedResult.!B20<>\"\",TEXT(spreedResult.!B20,\"YYYY\")&TEXT(spreedResult.!B20,\"MM\")&TEXT(spreedResult.!B20,\"DD\"),\"\")","v":""},{"$f":"IF(spreedResult.!C20<>\"\",VLOOKUP(spreedResult.!C20,spreedResult.!$AT$2:$AU$12,2,0),\"\")","v":""},{"$nulls":4},{"$f":"IF(spreedResult.!O20<>\"\",VLOOKUP(spreedResult.!O20,Course!$A$2:$B$612,2,0),\"\")","v":""},null,{"$f":"CONCATENATE(TRIM(ASC(spreedResult.!E20)),\" \",TRIM(ASC(spreedResult.!F20)))","v":" "},{"$f":"CONCATENATE(TRIM(spreedResult.!G20),\"　\",TRIM(spreedResult.!H20))","v":"　"},{"$f":"IFERROR(VLOOKUP(spreedResult.!J20,spreedResult.!$AW$4:$AX$5,2,0),\"\")","v":""},{"$f":"IF(spreedResult.!K20<>\"\",TEXT(spreedResult.!K20,\"YYYY\")&TEXT(spreedResult.!K20,\"MM\")&TEXT(spreedResult.!K20,\"DD\"),\"\")","v":""},null,null,{"$f":"IF(spreedResult.!$E20<>\"\",spreedResult.!$C$10,\"\")","v":""},{"$f":"IF(spreedResult.!$E20<>\"\",spreedResult.!$C$9,\"\")","v":""},{"$f":"IF(spreedResult.!L20<>\"\",spreedResult.!L20,\"\")","v":""},{"$f":"IF(spreedResult.!G20<>\"\",IF(spreedResult.!$H$8=\"左記ご住所に送付\",\"2\",\"\"),\"\")","v":""},{"$nulls":8},"",null,"",null,"",null,"",null,"",null,"",null,"",null,"",null,"",null,""]
[null,{"$f":"IF(spreedResult.!B21<>\"\",TEXT(spreedResult.!B21,\"YYYY\")&TEXT(spreedResult.!B21,\"MM\")&TEXT(spreedResult.!B21,\"DD\"),\"\")","v":""},{"$f":"IF(spreedResult.!C21<>\"\",VLOOKUP(spreedResult.!C21,spreedResult.!$AT$2:$AU$12,2,0),\"\")","v":""},{"$nulls":4},{"$f":"IF(spreedResult.!O21<>\"\",VLOOKUP(spreedResult.!O21,Course!$A$2:$B$612,2,0),\"\")","v":""},null,{"$f":"CONCATENATE(TRIM(ASC(spreedResult.!E21)),\" \",TRIM(ASC(spreedResult.!F21)))","v":" "},{"$f":"CONCATENATE(TRIM(spreedResult.!G21),\"　\",TRIM(spreedResult.!H21))","v":"　"},{"$f":"IFERROR(VLOOKUP(spreedResult.!J21,spreedResult.!$AW$4:$AX$5,2,0),\"\")","v":""},{"$f":"IF(spreedResult.!K21<>\"\",TEXT(spreedResult.!K21,\"YYYY\")&TEXT(spreedResult.!K21,\"MM\")&TEXT(spreedResult.!K21,\"DD\"),\"\")","v":""},null,null,{"$f":"IF(spreedResult.!$E21<>\"\",spreedResult.!$C$10,\"\")","v":""},{"$f":"IF(spreedResult.!$E21<>\"\",spreedResult.!$C$9,\"\")","v":""},{"$f":"IF(spreedResult.!L21<>\"\",spreedResult.!L21,\"\")","v":""},{"$f":"IF(spreedResult.!G21<>\"\",IF(spreedResult.!$H$8=\"左記ご住所に送付\",\"2\",\"\"),\"\")","v":""},{"$nulls":8},"",null,"",null,"",null,"",null,"",null,"",null,"",null,"",null,"",null,""]
{"$rows_left_out":253}
{"sheet":"Course","index":2,"n_rows":612,"n_cols":2,"rows_kept":612,"hidden":true}
["コース","コースID"]
["*ｺｰﾌﾟﾈｯﾄ深夜業健診（34才以下）",9589]
["*ｺｰﾌﾟﾈｯﾄ深夜業健診（35才以上）",9586]
["13AIA生活習慣病(胃直接)",10208]
["13ｶﾈｶ健保(35才.40才以上)",10206]
["13ｶﾈｶ健保(36才～39才)",10207]
["13大阪菓子(生活習慣病)",10203]
["13大阪菓子(婦人健診)ﾏﾝﾓ",10250]
["13大阪菓子(婦人健診)乳腺ｴｺｰ",10205]
["13大阪産業機械(生活習慣病)",10204]
{"$rows_left_out":603}
{"sheet":"PD","index":3,"n_rows":0,"n_cols":0,"rows_kept":0,"hidden":true}

{"sheet":"CD","index":4,"n_rows":0,"n_cols":0,"rows_kept":0,"hidden":true}